{"text_format":"1","workbook":"xlsx","n_sheets":17,"sheets":["Review Log","Model Guide","Glossary","Check Summary","Name labels","Inputs >","Target Revenue","Allocator Data","Asset Mapping","Calculations >","Pricing Area Allocations","RAB Allocations","RAB - Depreciation Allocations","Load Group Allocations","Outputs >","Rev - Pricing Area & Cust Group","Pricing Methodology Tables"],"not_rendered":{"charts":0,"images":1,"macros":1,"external_links":0,"defined_names":18,"comments":1,"pivot_tables":0},"unopened":[],"bounds":{"document_bytes":16777216,"sheet_cells":100000,"rows_first":2000,"rows_last":500,"rows_between":2000,"halvings":0,"cell_chars":16384,"cell_head_chars":4096},"cells_cut":0,"cells_raw":0,"read":"whole","date_system":"1900"}

{"sheet":"Review Log","index":0,"n_rows":5,"n_cols":2,"rows_kept":5,"cut":false,"hidden":false,"merged":[]}
[1,"Updated Commerce Act Levies in Target Revenue to agree to compliance model"]
[2,"Allocator Data Tab - Assumed ID references were for 2023 not 2022."]
[3,"Renamed connection charge to include new investment contracts"]
[4,"Deleted Te Anau from Allocator Data and Asset Mapping"]
[5,"Changed Cost Type for IRIS penalties to recoverable and passthrough"]

{"sheet":"Model Guide","index":1,"n_rows":86,"n_cols":3,"rows_kept":86,"cut":false,"hidden":false,"merged":[[85,1,85,7],[16,1,16,7],[77,1,77,7],[65,1,65,7],[69,1,69,7],[70,1,70,7],[71,1,71,7]]}
[]
[null,{"$f":"MID(CELL(\"filename\",A1),FIND(\"]\",CELL(\"filename\",A1))+1,255)","v":"Model Guide"}]
[]
[]
[null,"Key"]
[]
[null,"Input cell",1000]
[null,"Source Reference","xxx"]
[null,"Calculation cell",1000]
[null,"Calculated percentage","%"]
[null,"Total",1000]
[null,"Check cell - no error",0]
[null,"Check cell - error",{"$f":"SUM(C11)","v":1000}]
[]
[null,"Pricing Process"]
{"$rows_left_out":72}
{"sheet":"Glossary","index":2,"n_rows":21,"n_cols":3,"rows_kept":21,"cut":false,"hidden":false,"merged":[]}
[]
[null,{"$f":"MID(CELL(\"filename\",A1),FIND(\"]\",CELL(\"filename\",A1))+1,255)","v":"Glossary"}]
[]
[]
[null,"Abbreviation","Definition"]
[null,"ACOT","Avoided Cost of Transmission"]
[null,"Capex","Capital Expenditure"]
[null,"CoSM","Cost of Supply Model"]
[null,"CPD","Control Period Demand"]
[null,"CPP","Customised Pricing-quality Path"]
[null,"FENZ","Fire Emergency New Zealand"]
[null,"HV","High Voltage"]
[null,"ICP","Installation Control Point, and is further defined in the Code"]
[null,"IRIS","Incremental Rolling Incentive Scheme"]
[null,"km","kilometre"]
{"$rows_left_out":7}
{"sheet":"Check Summary","index":3,"n_rows":34,"n_cols":4,"rows_kept":34,"cut":false,"hidden":false,"merged":[]}
[]
[null,{"$f":"MID(CELL(\"filename\",A1),FIND(\"]\",CELL(\"filename\",A1))+1,255)","v":"Check Summary"}]
[null,"Description"]
[]
[null,"This sheet provides a summary of the checks witin the Workbook."]
[]
[]
[null,"Model Status","Flag","Check"]
[]
[null,"Model Status","Ok / Error",{"$f":"SUM(D12:D35)","v":0}]
[]
[null,"Target Revenue"]
[null,"Scaled revenue is equal to limit on forecast revenue from prices","Ok / Error",{"$f":"'Target Revenue'!J49","v":0}]
[]
[null,"Asset Mapping"]
{"$rows_left_out":20}
{"sheet":"Name labels","index":4,"n_rows":93,"n_cols":5,"rows_kept":93,"cut":false,"hidden":false,"merged":[]}
[]
[null,{"$f":"MID(CELL(\"filename\",A1),FIND(\"]\",CELL(\"filename\",A1))+1,255)","v":"Name labels"}]
[]
[null,"Description"]
[]
[null,"This sheet records the name labels and look-up tables used in the model."]
[]
[null,"Pricing Area Name","Customer Load Groups","Prior year","This Year"]
[]
[null,"Dunedin","Load group Streetlighting","RY25","RY26"]
[null,"Central Otago","Load group 1 (incl residential)"]
[null,"Queenstown","Load group 2"]
[null,"Te Anau","Load group 3"]
[null,null,"Load group 4"]
[null,null,"Load group 5"]
{"$rows_left_out":79}
{"sheet":"Inputs >","index":5,"n_rows":2,"n_cols":2,"rows_kept":2,"cut":false,"hidden":false,"merged":[]}
[]
[null,"This sheet has been deliberately left blank."]

{"sheet":"Target Revenue","index":6,"n_rows":58,"n_cols":12,"rows_kept":58,"cut":false,"hidden":false,"merged":[[44,11,44,21],[14,11,14,21],[16,11,21,21],[22,11,24,21],[25,11,25,21],[26,11,43,21]]}
[]
[null,{"$f":"MID(CELL(\"filename\",A1),FIND(\"]\",CELL(\"filename\",A1))+1,255)","v":"Target Revenue"}]
[]
[]
[]
[]
[]
[null,"Description"]
[]
[null,"In this sheet the target revenue is input at the cost category and cost item level consistent with the annual price-setting statement and the Commerce Commission's financial models."]
[null,"The Pricing Area and Load Group Allocators are selected to determine how costs are allocated."]
[null,"The target revenue is then scaled to match the total revenue allowable."]
[null,"More information about the target revenue components is provided in section 3.4 of the Pricing Methodology."]
[null,null,null,null,null,null,null,null,"UPDATED 23/09/2024"]
[null,{"$f":"'Name labels'!B17","v":"Target Revenue Components"},null,{"$f":"'Name labels'!B48","v":"Pricing Area Allocators"},{"$f":"'Name labels'!C48","v":"Load Group Allocators"},"Tariff Type",{"$f":"'Name labels'!B68","v":"Distribution / Passthrough"},{"$f":"'Name labels'!C68","v":"Cost type"},"RY25 inputs ($000's)","RY26 inputs ($000's)","Scaled target revenue","Source & comments"]
{"$rows_left_out":44}
{"sheet":"Allocator Data","index":7,"n_rows":210,"n_cols":11,"rows_kept":210,"cut":false,"hidden":false,"merged":[]}
[]
[null,{"$f":"MID(CELL(\"filename\",A1),FIND(\"]\",CELL(\"filename\",A1))+1,255)","v":"Allocator Data"}]
[null,{"$f":"'Name labels'!B8","v":"Pricing Area Name"},null,null,null,null,null,null,"Dunedin","Central Otago","Queenstown"]
[null,null,null,null,null,null,null,null,1,2,3]
[]
[]
[null,"Description"]
[]
[null,"In this sheet allocation data is input by pricing area and customer load group (if applicable):"]
[null,"The source of the information for each input is referenced in ","blue."]
[]
[1,{"$f":"'Name labels'!B50","v":"ICP Count"},"Units","Total"]
[]
[null,"Allocation to pricing categories"]
[null,null,null,null,null,null,null,null,"Information Disclosure 2024 - Schedule 8 (excluding Load group 0, Load Group 0A, and Distributed Generation)"]
{"$rows_left_out":196}
{"sheet":"Asset Mapping","index":8,"n_rows":136,"n_cols":9,"rows_kept":136,"cut":false,"hidden":false,"merged":[]}
[]
[null,"Asset Mapping"]
[]
[null,"Description"]
[]
[null,"In this sheet asset categories are firstly mapped to a network type (HV, LV, or Shared). "]
[null,"Each Load Group is then mapped to the network types used by that load group."]
[]
[]
[null,"Asset Categories","Network Voltage"]
[]
[null,"33KV Lines","HV","HV - CPD"]
[null,"33KV Cables","HV","HV - CPD"]
[null,"Zone Subs","LV","LV - CPD"]
[null,"HV lines","HV","HV - CPD"]
{"$rows_left_out":122}
{"sheet":"Calculations >","index":9,"n_rows":2,"n_cols":2,"rows_kept":2,"cut":false,"hidden":false,"merged":[]}
[]
[null,"This sheet has been deliberately left blank."]

{"sheet":"Pricing Area Allocations","index":10,"n_rows":62,"n_cols":12,"rows_kept":62,"cut":false,"hidden":false,"merged":[]}
[]
[null,"Pricing Area Allocations"]
[null,"Pricing Area Name",null,null,null,null,null,"Dunedin","Central Otago","Queenstown"]
[null,null,null,null,null,null,null,1,2,3]
[]
[]
[null,"Description"]
[]
[null,"This sheet allocates each component of target revenue to pricing areas based on the selected allocator, and calculated allocation percentages."]
[null,"More information about pricing area allocations are provided in section 3.5 of the Pricing Methodology."]
[]
[null,"Allocator percentages",null,null,null,null,null,"Dunedin","Central Otago","Queenstown",null,"check"]
[]
[1,"ICP Count",null,null,null,null,null,0.59971238990027631,0.2443634366709711,0.15592417342875256,null,0]
[2,"Total Circuit Length",null,null,null,null,null,0.3799057877478465,0.45619627463265422,0.16389793761949936,null,0]
{"$rows_left_out":48}
{"sheet":"RAB Allocations","index":11,"n_rows":125,"n_cols":11,"rows_kept":125,"cut":false,"hidden":false,"merged":[]}
[]
[null,"RAB Allocations"]
[null,"Pricing Area Name",null,null,null,null,null,null,"Dunedin","Central Otago","Queenstown"]
[null,null,null,null,null,null,null,null,1,2,3]
[]
[]
[null,"Description"]
[]
[null,"In this sheet the RAB is allocated to load groups based on the inputs from the Asset Mapping worksheet."]
[null,"More information about pricing area allocations are provided in section 3.5 of the Pricing Methodology."]
[]
[null,"RAB Allocator Summary","Units",null,null,"Total"]
[]
[null,"Load Group Summary"]
[]
{"$rows_left_out":111}
{"sheet":"RAB - Depreciation Allocations","index":12,"n_rows":125,"n_cols":11,"rows_kept":125,"cut":false,"hidden":false,"merged":[]}
[]
[null,{"$f":"MID(CELL(\"filename\",A1),FIND(\"]\",CELL(\"filename\",A1))+1,255)","v":"RAB - Depreciation Allocations"}]
[null,{"$f":"'Name labels'!B8","v":"Pricing Area Name"},null,null,null,null,null,null,"Dunedin","Central Otago","Queenstown"]
[null,null,null,null,null,null,null,null,1,2,3]
[]
[]
[null,"Description"]
[]
[null,"In this sheet the Depreciation is allocated to load groups based on the inputs from the Asset Mapping worksheet."]
[null,"More information about pricing area allocations are provided in section 3.5 of the Pricing Methodology."]
[]
[null,"RAB Allocator Summary","Units",null,null,"Total"]
[]
[null,"Load Group Summary"]
[]
{"$rows_left_out":111}
{"sheet":"Load Group Allocations","index":13,"n_rows":323,"n_cols":9,"rows_kept":323,"cut":false,"hidden":false,"merged":[]}
[]
[null,"Load Group Allocations"]
[null,"Pricing Area Name",null,null,null,null,"Dunedin","Central Otago","Queenstown"]
[null,null,null,null,null,null,1,2,3]
[]
[]
[null,"Description"]
[]
[null,"In this sheet the cost of supply for each pricing area is allocated to each load group."]
[null,"More information about load group allocation is provided in section 3.6 of the Pricing Methodology."]
[]
[null,"Load group Streetlighting","Units","Allocator","Distribution / Passthrough","Tariff Types"]
[]
[null,"Load Group Allocators"]
[]
{"$rows_left_out":309}
{"sheet":"Outputs >","index":14,"n_rows":2,"n_cols":2,"rows_kept":2,"cut":false,"hidden":false,"merged":[]}
[]
[null,"This sheet has been deliberately left blank."]

{"sheet":"Rev - Pricing Area & Cust Group","index":15,"n_rows":46,"n_cols":10,"rows_kept":46,"cut":false,"hidden":false,"merged":[]}
[]
[null,"Rev - Pricing Area & Cust Group"]
[null,"Pricing Area Name",null,null,null,null,null,"Dunedin","Central Otago","Queenstown"]
[null,null,null,null,null,null,null,1,2,3]
[]
[]
[null,"Description"]
[]
[null,"This sheet summarises the output of the model with target revenue split into pricing area, customer load group, and distribution/passthrough."]
[]
[]
[null,"Distribution",null,null,null,"Units",null,"Dunedin","Central Otago","Queenstown"]
[]
[null,null,null,"Load group Streetlighting",396.60972507089036,"$000's",null,267.00555605129057,91.649708277059091,37.954460742540704]
[null,null,null,"Load group 1 (incl residential)",72445.090584091435,"$000's",null,39920.624280458418,21590.367875175889,10934.098428457131]
{"$rows_left_out":32}
{"sheet":"Pricing Methodology Tables","index":16,"n_rows":47,"n_cols":32,"rows_kept":47,"cut":false,"hidden":false,"merged":[[10,6,11,6],[10,7,10,10],[10,29,11,29],[10,23,10,28]]}
[]
[null,{"$f":"MID(CELL(\"filename\",A1),FIND(\"]\",CELL(\"filename\",A1))+1,255)","v":"Pricing Methodology Tables"}]
[null,"Description"]
[]
[null,"This sheet links the model information in a format to be included in our annual Pricing Methodology document."]
[]
[]
[]
[]
[null,null,"Table 2: Components of forecast allowable revenue ($m)",null,null,null,"Table 4: Pricing area allocation percentages",null,null,null,null,null,null,null,"Table 5: Total forecast allowable revenue by pricing area",null,null,null,null,null,null,null,"Table 8: Load group allocation percentages"]
[null,null,null,{"$f":"'Name labels'!$E$10","v":"RY26"},{"$f":"'Name labels'!$D$10","v":"RY25"},null,"Cost Allocators","Pricing Area",null,null,null,null,null,null,"Components ($m)","Dunedin","Central","Queenstown","Total",null,null,null,null,"Load Group",null,null,null,null,null,"Total"]
[null,null,{"$f":"'Name labels'!C70","v":"Capital related costs"},null,null,null,null,"Dunedin","Central","Queenstown","Total",null,null,null,{"$f":"'Name labels'!C70","v":"Capital related costs"},{"$f":"(SUMIF('Pricing Area Allocations'!$C$31:$J$58,$O12,'Pricing Area Allocations'!H$31:H$58))/1000","v":32.01486332105307},{"$f":"(SUMIF('Pricing Area Allocations'!$C$31:$J$58,$O12,'Pricing Area Allocations'!I$31:I$58))/1000","v":22.712173333137958},{"$f":"(SUMIF('Pricing Area Allocations'!$C$31:$J$58,$O12,'Pricing Area Allocations'!J$31:J$58))/1000","v":12.583716486248006},{"$f":"SUM(P12:R12)","v":67.310753140439033},null,null,null,"Cost Allocators "," SL ","L1 ","L2 ","L3 ","L4 ","L5 "]
[null,null,{"$f":"'Name labels'!B25","v":"Asset revaluations and other regulatory revenue"},{"$f":"SUMIF('Target Revenue'!$B$17:$J$47,$C13,'Target Revenue'!$J$17:$J$47)/1000","v":-16.167272790798499},{"$f":"SUMIF('Target Revenue'!$B$17:$J$47,$C13,'Target Revenue'!$I$17:$I$47)/1000","v":-14.969489381004101},null,{"$f":"'Pricing Area Allocations'!B14","v":"ICP Count"},{"$f":"'Pricing Area Allocations'!H14","v":0.59971238990027631},{"$f":"'Pricing Area Allocations'!I14","v":0.2443634366709711},{"$f":"'Pricing Area Allocations'!J14","v":0.15592417342875256},{"$f":"SUM(H13:J13)","v":0.99999999999999989},null,{"$f":"IF(K13=1,0,1)","v":0},null,{"$f":"'Name labels'!C71","v":"Operational costs"},{"$f":"(SUMIF('Pricing Area Allocations'!$C$31:$J$58,$O13,'Pricing Area Allocations'!H$31:H$58))/1000","v":26.494261248138748},{"$f":"(SUMIF('Pricing Area Allocations'!$C$31:$J$58,$O13,'Pricing Area Allocations'!I$31:I$58))/1000","v":15.705250647360041},{"$f":"(SUMIF('Pricing Area Allocations'!$C$31:$J$58,$O13,'Pricing Area Allocations'!J$31:J$58))/1000","v":7.6616100568706118},{"$f":"SUM(P13:R13)","v":49.861121952369402},null,null,null,"Dunedin"]
[null,null,{"$f":"'Name labels'!B24","v":"Depreciation"},{"$f":"SUMIF('Target Revenue'!$B$17:$J$47,$C14,'Target Revenue'!$J$17:$J$47)/1000","v":24.5516844866479},{"$f":"SUMIF('Target Revenue'!$B$17:$J$47,$C14,'Target Revenue'!$I$17:$I$47)/1000","v":23.086187750556199},null,{"$f":"'Pricing Area Allocations'!B15","v":"Total Circuit Length"},{"$f":"'Pricing Area Allocations'!H15","v":0.3799057877478465},{"$f":"'Pricing Area Allocations'!I15","v":0.45619627463265422},{"$f":"'Pricing Area Allocations'!J15","v":0.16389793761949936},1,null,0,null,{"$f":"'Name labels'!C72","v":"Passthrough and recoverable costs"},{"$f":"(SUMIF('Pricing Area Allocations'!$C$31:$J$58,$O14,'Pricing Area Allocations'!H$31:H$58))/1000","v":32.884021402561494},{"$f":"(SUMIF('Pricing Area Allocations'!$C$31:$J$58,$O14,'Pricing Area Allocations'!I$31:I$58))/1000","v":15.761230987422826},{"$f":"(SUMIF('Pricing Area Allocations'!$C$31:$J$58,$O14,'Pricing Area Allocations'!J$31:J$58))/1000","v":12.340834517207254},{"$f":"SUM(P14:R14)","v":60.986086907191577},null,null,null,{"$f":"'Load Group Allocations'!B16","v":"ICP Count"},{"$f":"'Allocator Data'!$I$26","v":3.5405011314271118E-5},{"$f":"'Allocator Data'!$I$27","v":0.93865133786767341},{"$f":"'Allocator Data'!$I$28","v":5.6236894337572438E-2},{"$f":"'Allocator Data'!$I$29","v":3.64289513272809E-3},{"$f":"'Allocator Data'!$I$30","v":1.3272526167690082E-3},{"$f":"'Allocator Data'!$I$31","v":1.0621503394281335E-4},{"$f":"SUM(X14:AC14)","v":1},null,{"$f":"IF(AD14=1,0,1)","v":0}]
[null,null,{"$f":"'Name labels'!B27","v":"Return on capital"},{"$f":"SUMIF('Target Revenue'!$B$17:$J$47,$C15,'Target Revenue'!$J$17:$J$47)/1000","v":49.796286798448889},{"$f":"SUMIF('Target Revenue'!$B$17:$J$47,$C15,'Target Revenue'!$I$17:$I$47)/1000","v":30.078693430175953},null,{"$f":"'Pricing Area Allocations'!B16","v":"Overhead Circuit Length"},{"$f":"'Pricing Area Allocations'!H16","v":0.43839361120610987},{"$f":"'Pricing Area Allocations'!I16","v":0.45844133745203358},{"$f":"'Pricing Area Allocations'!J16","v":0.10316505134185656},1,null,0,null,"Total forecast allowable revenue",{"$f":"SUM(P12:P14)","v":91.393145971753313},{"$f":"SUM(Q12:Q14)","v":54.178654967920828},{"$f":"SUM(R12:R14)","v":32.586161060325871},{"$f":"SUM(S12:S14)","v":178.157962},null,null,null,{"$f":"'Load Group Allocations'!B17","v":"CPD"},{"$f":"'Allocator Data'!$I$66","v":8.2925396514587392E-3},{"$f":"'Allocator Data'!$I$67","v":0.6597116158649361},{"$f":"'Allocator Data'!$I$68","v":0.1367480364641121},{"$f":"'Allocator Data'!$I$69","v":8.0275438940016541E-2},{"$f":"'Allocator Data'!$I$70","v":8.1914801035615173E-2},{"$f":"'Allocator Data'!$I$71","v":3.3057568043861195E-2},{"$f":"SUM(X15:AC15)","v":0.99999999999999989},null,{"$f":"IF(AD15=1,0,1)","v":0}]
{"$rows_left_out":32}